Target
C-C chemokine receptor type 4
Ligand
BDBM50307030
Substrate
Meas. Tech.
ChEMBL_609338 (CHEMBL1072093)
IC50
1320±n/a nM
Citation
 Li, GWang, DSun, MLi, GHu, JZhang, YYuan, YJi, HChen, NLiu, G Discovery and optimization of novel 3-piperazinylcoumarin antagonist of chemokine-like factor 1 with oral antiasthma activity in mice. J Med Chem 53:1741-54 (2010)  
Target
Name:
C-C chemokine receptor type 4
Synonyms:
C-C CKR-4 C-C chemokine receptor type 4 (CCR4) CCR-4 CCR4_HUMAN CMKBR4 | K5-5
Type:
Enzyme
Mol. Mass.:
41406.41
Organism:
Homo sapiens (Human)
Description:
P51679
Residue:
360
  
Inhibitor
Name:
BDBM50307030
Synonyms:
4-(5,7-Dihydroxy-4-methyl-2-oxo-2H-chromen-3-yl)-N-(4-isopropylphenyl)piperazine-1-carboxamide | CHEMBL606421
Type:
Small organic molecule
Emp. Form.:
C24H27N3O5
Mol. Mass.:
437.4883
SMILES:
CC(C)c1ccc(NC(=O)N2CCN(CC2)c2c(C)c3c(O)cc(O)cc3oc2=O)cc1
: