Target
Monoacylglycerol lipase ABHD6
Ligand
BDBM50307064
Substrate
Meas. Tech.
ChEMBL_609360 (CHEMBL1072746)
IC50
900±n/a nM
Citation
 Long, JZJin, XAdibekian, ALi, WCravatt, BF Characterization of tunable piperidine and piperazine carbamates as inhibitors of endocannabinoid hydrolases. J Med Chem 53:1830-42 (2010)  
Target
Name:
Monoacylglycerol lipase ABHD6
Synonyms:
ABHD6_MOUSE Abhd6 Monoacylglycerol lipase ABHD6
Type:
Single-pass type II membrane protein; hydrolase
Mol. Mass.:
38216.17
Organism:
Mus musculus (mouse)
Description:
Assays were using membranes of recombinant Abh6 transiently transfected in COS-7 cells.
Residue:
336
  
Inhibitor
Name:
BDBM50307064
Synonyms:
4-nitrophenyl 4-(bis(4-fluorophenyl)methyl)piperazine-1-carboxylate | CHEMBL602499
Type:
Small organic molecule
Emp. Form.:
C24H21F2N3O4
Mol. Mass.:
453.438
SMILES:
[O-][N+](=O)c1ccc(OC(=O)N2CCN(CC2)C(c2ccc(F)cc2)c2ccc(F)cc2)cc1
: