Target
Prothrombin
Ligand
BDBM12657
Substrate
Meas. Tech.
ChEMBL_609370 (CHEMBL1072756)
Ki
6000±n/a nM
Citation
 Quan, MLPinto, DJRossi, KASheriff, SAlexander, RSAmparo, EKish, KKnabb, RMLuettgen, JMMorin, PSmallwood, AWoerner, FJWexler, RR Phenyltriazolinones as potent factor Xa inhibitors. Bioorg Med Chem Lett 20:1373-7 (2010)  
Target
Name:
Prothrombin
Synonyms:
Activation peptide fragment 1 Coagulation factor II Prothrombin precursor Thrombin heavy chain | Thrombin light chain
Type:
Protein
Mol. Mass.:
70029.57
Organism:
Homo sapiens (Human)
Description:
P00734
Residue:
622
  
Inhibitor
Name:
BDBM12657
Synonyms:
1-[3-(Aminomethyl)phenyl]-N-[3-fluoro-2-(methylsulfonyl)-[1,1-biphenyl]-4-yl]-3-(trifluoromethyl)-1H-pyrazole-5-carboxamide CHEMBL559015 DPC423
Type:
Small organic molecule
Emp. Form.:
C25H20F4N4O3S
Mol. Mass.:
532.51
SMILES:
CS(=O)(=O)c1ccccc1-c1ccc(NC(=O)c2cc(nn2-c2cccc(CN)c2)C(F)(F)F)c(F)c1
: