Target
Coagulation factor X
Ligand
BDBM12676
Substrate
Meas. Tech.
ChEMBL_609369 (CHEMBL1072755)
Ki
0.19±n/a nM
Citation
 Quan, MLPinto, DJRossi, KASheriff, SAlexander, RSAmparo, EKish, KKnabb, RMLuettgen, JMMorin, PSmallwood, AWoerner, FJWexler, RR Phenyltriazolinones as potent factor Xa inhibitors. Bioorg Med Chem Lett 20:1373-7 (2010)  
Target
Name:
Coagulation factor X
Synonyms:
Activated coagulation factor X (FXa) Coagulation factor X precursor F10 Factor X heavy chain Factor Xa Stuart-Prower factor
Type:
Enzyme
Mol. Mass.:
54726.60
Organism:
Homo sapiens (Human)
Description:
Residue:
488
  
Inhibitor
Name:
BDBM12676
Synonyms:
1-(3-Aminobenzisoxazol-5-yl)-3-trifluoromethyl-N-[2-fluoro-4-[(2-dimethylaminomethyl)imidazol-1-yl]phenyl]-1H-pyrazole-5-carboxyamide Hydrochloride Salt BMS-561389 CHEMBL558198 Razaxaban
Type:
Small organic molecule
Emp. Form.:
C24H20F4N8O2
Mol. Mass.:
528.4616
SMILES:
CN(C)Cc1nccn1-c1ccc(NC(=O)c2cc(nn2-c2ccc3onc(N)c3c2)C(F)(F)F)c(F)c1
: