Target
Cytochrome P450 11B2, mitochondrial
Ligand
BDBM50188085
Substrate
Meas. Tech.
ChEMBL_610340 (CHEMBL1072072)
IC50
330±n/a nM
Citation
 Roumen, LPeeters, JWEmmen, JMBeugels, IPCusters, EMde Gooyer, MPlate, RPieterse, KHilbers, PASmits, JFVekemans, JALeysen, DOttenheijm, HCJanssen, HMHermans, JJ Synthesis, biological evaluation, and molecular modeling of 1-benzyl-1H-imidazoles as selective inhibitors of aldosterone synthase (CYP11B2). J Med Chem 53:1712-25 (2010)  
Target
Name:
Cytochrome P450 11B2, mitochondrial
Synonyms:
Aldosterone Synthase (CYP11B2) Aldosterone-synthesizing enzyme CYP11B2 Cytochrome P450 11B2 Cytochrome P450 11B2, mitochondrial P-450C18 | Steroid 18-hydroxylase
Type:
Protein
Mol. Mass.:
57582.15
Organism:
Homo sapiens (Human)
Description:
P19099
Residue:
503
  
Inhibitor
Name:
BDBM50188085
Synonyms:
1-(4-Fluorobenzyl)-1H-imidazole | CHEMBL377770
Type:
Small organic molecule
Emp. Form.:
C10H9FN2
Mol. Mass.:
176.1903
SMILES:
Fc1ccc(Cn2ccnc2)cc1
: