Target
Cytochrome P450 11B2, mitochondrial
Ligand
BDBM50307238
Substrate
Meas. Tech.
ChEMBL_610340 (CHEMBL1072072)
IC50
23±n/a nM
Citation
 Roumen, LPeeters, JWEmmen, JMBeugels, IPCusters, EMde Gooyer, MPlate, RPieterse, KHilbers, PASmits, JFVekemans, JALeysen, DOttenheijm, HCJanssen, HMHermans, JJ Synthesis, biological evaluation, and molecular modeling of 1-benzyl-1H-imidazoles as selective inhibitors of aldosterone synthase (CYP11B2). J Med Chem 53:1712-25 (2010)  
Target
Name:
Cytochrome P450 11B2, mitochondrial
Synonyms:
Aldosterone Synthase (CYP11B2) Aldosterone-synthesizing enzyme CYP11B2 Cytochrome P450 11B2 Cytochrome P450 11B2, mitochondrial P-450C18 | Steroid 18-hydroxylase
Type:
Protein
Mol. Mass.:
57582.15
Organism:
Homo sapiens (Human)
Description:
P19099
Residue:
503
  
Inhibitor
Name:
BDBM50307238
Synonyms:
1-(4-Cyanobenzyl)-5-bromo-1H-imidazole | CHEMBL599223
Type:
Small organic molecule
Emp. Form.:
C11H8BrN3
Mol. Mass.:
262.105
SMILES:
Brc1cncn1Cc1ccc(cc1)C#N
: