Target
Cathepsin D
Ligand
BDBM50307360
Substrate
Meas. Tech.
ChEMBL_610638 (CHEMBL1069652)
Ki
3350±n/a nM
Citation
 Björklund, CAdolfsson, HJansson, KLindberg, JVrang, LHallberg, ARosenquist, SSamuelsson, B Discovery of potent BACE-1 inhibitors containing a new hydroxyethylene (HE) scaffold: exploration of P1' alkoxy residues and an aminoethylene (AE) central core. Bioorg Med Chem 18:1711-23 (2010)  
Target
Name:
Cathepsin D
Synonyms:
CATD_HUMAN CTSD Cathepsin D heavy chain Cathepsin D precursor
Type:
Enzyme
Mol. Mass.:
44551.72
Organism:
Homo sapiens (Human)
Description:
Human proCathepsin D (SwissProt accession number P07339) was expressed in Sf9 cells, purified, and autoactivated.
Residue:
412
  
Inhibitor
Name:
BDBM50307360
Synonyms:
CHEMBL591699 | N1-((2S,3S,5R)-6-((S)-1-(benzylamino)-3-methyl-1-oxobutan-2-ylamino)-1-(3,5-difluorophenoxy)-5-ethoxy-3-hydroxy-6-oxohexan-2-yl)-5-(N-methylmethylsulfonamido)-N3-((R)-1-phenylethyl)isophthalamide
Type:
Small organic molecule
Emp. Form.:
C44H53F2N5O9S
Mol. Mass.:
865.982
SMILES:
CCO[C@H](C[C@H](O)[C@H](COc1cc(F)cc(F)c1)NC(=O)c1cc(cc(c1)C(=O)N[C@H](C)c1ccccc1)N(C)S(C)(=O)=O)C(=O)N[C@@H](C(C)C)C(=O)NCc1ccccc1
: