Target
Cathepsin D
Ligand
BDBM50307357
Substrate
Meas. Tech.
ChEMBL_610638 (CHEMBL1069652)
Ki
>5000±n/a nM
Citation
 Björklund, CAdolfsson, HJansson, KLindberg, JVrang, LHallberg, ARosenquist, SSamuelsson, B Discovery of potent BACE-1 inhibitors containing a new hydroxyethylene (HE) scaffold: exploration of P1' alkoxy residues and an aminoethylene (AE) central core. Bioorg Med Chem 18:1711-23 (2010)  
Target
Name:
Cathepsin D
Synonyms:
CATD_HUMAN CTSD Cathepsin D heavy chain Cathepsin D precursor
Type:
Enzyme
Mol. Mass.:
44551.72
Organism:
Homo sapiens (Human)
Description:
Human proCathepsin D (SwissProt accession number P07339) was expressed in Sf9 cells, purified, and autoactivated.
Residue:
412
  
Inhibitor
Name:
BDBM50307357
Synonyms:
CHEMBL601523 | N-[(1S,2S,4R)-2-Azido-4-((S)-1-benzylcarbamoyl-2-methyl-propylcarbamoyl)-1-(3,5-difluoro-phenoxymethyl)-4-methoxy-butyl]-5-(methanesulfonyl-methyl-amino)-N'-((R)-1-phenyl-ethyl)-isophthalamide
Type:
Small organic molecule
Emp. Form.:
C43H50F2N8O8S
Mol. Mass.:
876.968
SMILES:
CO[C@H](C[C@H](N=[N+]=[N-])[C@H](COc1cc(F)cc(F)c1)NC(=O)c1cc(cc(c1)C(=O)N[C@H](C)c1ccccc1)N(C)S(C)(=O)=O)C(=O)N[C@@H](C(C)C)C(=O)NCc1ccccc1
: