Target
Sodium-dependent dopamine transporter
Ligand
BDBM50307460
Substrate
Meas. Tech.
ChEMBL_611011 (CHEMBL1072387)
IC50
22834±n/a nM
Citation
 Vu, ATCohn, STZhang, PKim, CYMahaney, PEBray, JAJohnston, GHKoury, EJCosmi, SADeecher, DCSmith, VAHarrison, JELeventhal, LWhiteside, GTKennedy, JDTrybulski, EJ 1-(Indolin-1-yl)-1-phenyl-3-propan-2-olamines as potent and selective norepinephrine reuptake inhibitors. J Med Chem 53:2051-62 (2010)  
Target
Name:
Sodium-dependent dopamine transporter
Synonyms:
DA transporter DAT1 Dopamine transporter protein (DAT) SC6A3_HUMAN Sodium-dependent dopamine transporter Solute carrier family 6 member 3
Type:
Multi-pass membrane protein
Mol. Mass.:
68497.11
Organism:
Homo sapiens (Human)
Description:
Q01959
Residue:
620
  
Inhibitor
Name:
BDBM50307460
Synonyms:
(1S,2R)-1-(7-Fluoro-3,3-dimethyl-2,3-dihydro-1H-indol-1-yl)-1-(3-fluorophenyl)-3-(methylamino)propan-2-ol Hydrochloride | CHEMBL598614
Type:
Small organic molecule
Emp. Form.:
C20H24F2N2O
Mol. Mass.:
346.4142
SMILES:
CNC[C@@H](O)[C@@H](N1CC(C)(C)c2cccc(F)c12)c1cccc(F)c1
: