Target
Serine/threonine-protein kinase Nek6
Ligand
BDBM50307507
Substrate
Meas. Tech.
ChEMBL_612008 (CHEMBL1072215)
IC50
>10000±n/a nM
Citation
 Traquandi, GCiomei, MBallinari, DCasale, EColombo, NCroci, VFiorentini, FIsacchi, ALongo, AMercurio, CPanzeri, APastori, WPevarello, PVolpi, DRoussel, PVulpetti, ABrasca, MG Identification of potent pyrazolo[4,3-h]quinazoline-3-carboxamides as multi-cyclin-dependent kinase inhibitors. J Med Chem 53:2171-87 (2010)  
Target
Name:
Serine/threonine-protein kinase Nek6
Synonyms:
NEK kinase NEK6_HUMAN
Type:
PROTEIN
Mol. Mass.:
35724.53
Organism:
Homo sapiens (Human)
Description:
ChEMBL_1446777
Residue:
313
  
Inhibitor
Name:
BDBM50307507
Synonyms:
CHEMBL597754 | N-1-Dimethyl-8-{[1-(methylsulfonyl)piperidin-4-yl]amino}-4,5-dihydro-1H-pyrazolo[4,3-h]quinazoline-3-carboxamide
Type:
Small organic molecule
Emp. Form.:
C24H34N8O4S
Mol. Mass.:
530.643
SMILES:
CNC(=O)c1nn(C)c-2c1CCc1cnc(NC3CCN(CC3)C(=O)C3CCN(CC3)S(C)(=O)=O)nc-21
: