Target
Epidermal growth factor receptor
Ligand
BDBM50307784
Substrate
Meas. Tech.
ChEMBL_612309 (CHEMBL1064921)
IC50
99±n/a nM
Citation
 Cai, XZhai, HXWang, JForrester, JQu, HYin, LLai, CJBao, RQian, C Discovery of 7-(4-(3-ethynylphenylamino)-7-methoxyquinazolin-6-yloxy)-N-hydroxyheptanamide (CUDc-101) as a potent multi-acting HDAC, EGFR, and HER2 inhibitor for the treatment of cancer. J Med Chem 53:2000-9 (2010)  
Target
Name:
Epidermal growth factor receptor
Synonyms:
EGF Receptor Substrate EGFR_HUMAN ERBB1 Epidermal Growth Factor Receptor erbB-1 Epidermal growth factor receptor (EGFR) HER1 Proto-oncogene c-ErbB-1 Tyrosine-Protein Kinase ErbB-1
Type:
Receptor Kinase Domain
Mol. Mass.:
134279.59
Organism:
Homo sapiens (Human)
Description:
P00533
Residue:
1210
  
Inhibitor
Name:
BDBM50307784
Synonyms:
7-(4-(Benzylamino)-7-methoxyquinazolin-6-yloxy)-N-hydroxyheptanamide | CHEMBL596761
Type:
Small organic molecule
Emp. Form.:
C23H28N4O4
Mol. Mass.:
424.4928
SMILES:
COc1cc2ncnc(NCc3ccccc3)c2cc1OCCCCCCC(=O)NO
: