Target
Acetylcholinesterase
Ligand
BDBM50307928
Substrate
Meas. Tech.
ChEMBL_608062 (CHEMBL1072132)
IC50
6400±n/a nM
Citation
 Alptüzün, VPrinz, MHörr, VScheiber, JRadacki, KFallarero, AVuorela, PEngels, BBraunschweig, HErciyas, EHolzgrabe, U Interaction of (benzylidene-hydrazono)-1,4-dihydropyridines with beta-amyloid, acetylcholine, and butyrylcholine esterases. Bioorg Med Chem 18:2049-59 (2010)  
Target
Name:
Acetylcholinesterase
Synonyms:
ACES_ELEEL Acetylcholinesterase (EeAChE) | ache
Type:
Enzyme
Mol. Mass.:
71812.79
Organism:
Electrophorus electricus (Electric eel)
Description:
Residue:
633
  
Inhibitor
Name:
BDBM50307928
Synonyms:
1-(2,6-dichlorobenzyl)-4-((2,6-dichlorobenzylidene)hydrazono)-1,4-dihydropyridine | CHEMBL597994
Type:
Small organic molecule
Emp. Form.:
C19H13Cl4N3
Mol. Mass.:
425.139
SMILES:
Clc1cccc(Cl)c1Cn1ccc(cc1)=N\N=C\c1c(Cl)cccc1Cl
: