Target
Cytochrome P450 2C19
Ligand
BDBM50307943
Substrate
Meas. Tech.
ChEMBL_608359 (CHEMBL1074393)
IC50
>10000±n/a nM
Citation
 McHardy, TCaldwell, JJCheung, KMHunter, LJTaylor, KRowlands, MRuddle, RHenley, Ade Haven Brandon, AValenti, MDavies, TGFazal, LSeavers, LRaynaud, FIEccles, SAAherne, GWGarrett, MDCollins, I Discovery of 4-amino-1-(7H-pyrrolo[2,3-d]pyrimidin-4-yl)piperidine-4-carboxamides as selective, orally active inhibitors of protein kinase B (Akt). J Med Chem 53:2239-49 (2010)  
Target
Name:
Cytochrome P450 2C19
Synonyms:
CP2CJ_HUMAN CYPIIC17 Cytochrome P450 2C19 (CYP2C19) Mephenytoin 4-hydroxylase P450-254C
Type:
Enzyme
Mol. Mass.:
55935.47
Organism:
Homo sapiens (Human)
Description:
P33261
Residue:
490
  
Inhibitor
Name:
BDBM50307943
Synonyms:
4-(4-tert-Butylbenzyl)-1-(7H-pyrrolo[2,3-d]pyrimidin-4-yl)piperidin-4-amine US8796293, 56
Type:
Small organic molecule
Emp. Form.:
C22H29N5
Mol. Mass.:
363.4992
SMILES:
CC(C)(C)c1ccc(CC2(N)CCN(CC2)c2ncnc3[nH]ccc23)cc1
: