Target
Extracellular calcium-sensing receptor
Ligand
BDBM50308068
Substrate
Meas. Tech.
ChEMBL_610755 (CHEMBL1064390)
IC50
5500±n/a nM
Citation
 Widler, LAltmann, EBeerli, RBreitenstein, WBouhelal, RBuhl, TGamse, RGerspacher, MHalleux, CJohn, MRLehmann, HKalb, OKneissel, MMissbach, MMüller, IRReidemeister, SRenaud, JTaillardat, ATommasi, RWeiler, SWolf, RMSeuwen, K 1-Alkyl-4-phenyl-6-alkoxy-1H-quinazolin-2-ones: a novel series of potent calcium-sensing receptor antagonists. J Med Chem 53:2250-63 (2010)  
Target
Name:
Extracellular calcium-sensing receptor
Synonyms:
CASR CaR Calcium-sensing receptor (CaSR) GPRC2A Parathyroid Cell calcium-sensing receptor Synonyms=GPRC2A | hCasR
Type:
Protein
Mol. Mass.:
120663.13
Organism:
Homo sapiens (Human)
Description:
P41180
Residue:
1078
  
Inhibitor
Name:
BDBM50308068
Synonyms:
4-Biphenyl-4-yl-1-isopropyl-6-methoxy-1H-quinazolin-2-one | CHEMBL599869
Type:
Small organic molecule
Emp. Form.:
C24H22N2O2
Mol. Mass.:
370.4437
SMILES:
COc1ccc2n(C(C)C)c(=O)nc(-c3ccc(cc3)-c3ccccc3)c2c1
: