Target
Extracellular calcium-sensing receptor
Ligand
BDBM50308095
Substrate
Meas. Tech.
ChEMBL_610755 (CHEMBL1064390)
IC50
520±n/a nM
Citation
 Widler, LAltmann, EBeerli, RBreitenstein, WBouhelal, RBuhl, TGamse, RGerspacher, MHalleux, CJohn, MRLehmann, HKalb, OKneissel, MMissbach, MMüller, IRReidemeister, SRenaud, JTaillardat, ATommasi, RWeiler, SWolf, RMSeuwen, K 1-Alkyl-4-phenyl-6-alkoxy-1H-quinazolin-2-ones: a novel series of potent calcium-sensing receptor antagonists. J Med Chem 53:2250-63 (2010)  
Target
Name:
Extracellular calcium-sensing receptor
Synonyms:
CASR CaR Calcium-sensing receptor (CaSR) GPRC2A Parathyroid Cell calcium-sensing receptor Synonyms=GPRC2A | hCasR
Type:
Protein
Mol. Mass.:
120663.13
Organism:
Homo sapiens (Human)
Description:
P41180
Residue:
1078
  
Inhibitor
Name:
BDBM50308095
Synonyms:
6-Diethylamino-1-isopropyl-4-(4-isopropyl-phenyl)-1H-quinazolin-2-one | CHEMBL599857
Type:
Small organic molecule
Emp. Form.:
C24H31N3O
Mol. Mass.:
377.5224
SMILES:
CCN(CC)c1ccc2n(C(C)C)c(=O)nc(-c3ccc(cc3)C(C)C)c2c1
: