Target
Cholinesterase
Ligand
BDBM50308415
Substrate
Meas. Tech.
ChEMBL_613957 (CHEMBL1068997)
Ki
1560±n/a nM
Citation
 Darvesh, SPottie, IRDarvesh, KVMcDonald, RSWalsh, RConrad, SPenwell, AMataija, DMartin, E Differential binding of phenothiazine urea derivatives to wild-type human cholinesterases and butyrylcholinesterase mutants. Bioorg Med Chem 18:2232-44 (2010)  
Target
Name:
Cholinesterase
Synonyms:
Acylcholine acylhydrolase Butyrylcholine esterase (BChE) Butyrylcholinesterase (BuChE) CHLE_HUMAN Cholinesterases Pseudocholinesterase
Type:
Homotetramer
Mol. Mass.:
68422.27
Organism:
Homo sapiens (Human)
Description:
P06276
Residue:
602
  
Inhibitor
Name:
BDBM50308415
Synonyms:
(1'H-Phenothiazin-1'-yl)(piperidin-1-yl)methanone | CHEMBL589252
Type:
Small organic molecule
Emp. Form.:
C18H18N2OS
Mol. Mass.:
310.413
SMILES:
O=C(N1CCCCC1)N1c2ccccc2Sc2ccccc12
: