Target
Acetylcholinesterase
Ligand
BDBM50308420
Substrate
Meas. Tech.
ChEMBL_613958 (CHEMBL1068998)
Ki
620±n/a nM
Citation
 Darvesh, SPottie, IRDarvesh, KVMcDonald, RSWalsh, RConrad, SPenwell, AMataija, DMartin, E Differential binding of phenothiazine urea derivatives to wild-type human cholinesterases and butyrylcholinesterase mutants. Bioorg Med Chem 18:2232-44 (2010)  
Target
Name:
Acetylcholinesterase
Synonyms:
ACES_HUMAN Acetylcholinesterase (AChE) | Acetylcholinesterase (human AChE)
Type:
Enzyme
Mol. Mass.:
67792.70
Organism:
Homo sapiens (Human)
Description:
P22303
Residue:
614
  
Inhibitor
Name:
BDBM50308420
Synonyms:
CHEMBL589563 | N-[2-(Piperidinyl)ethyl]-10H-phenothiazine-10-carboxamide
Type:
Small organic molecule
Emp. Form.:
C20H23N3OS
Mol. Mass.:
353.481
SMILES:
O=C(NCCN1CCCCC1)N1c2ccccc2Sc2ccccc12
: