Target
P2Y purinoceptor 1
Ligand
BDBM50308552
Substrate
Meas. Tech.
ChEMBL_613523 (CHEMBL1073634)
EC50
1.89±n/a nM
Citation
 Kumar, TSZhou, SYJoshi, BVBalasubramanian, RYang, TLiang, BTJacobson, KA Structure-activity relationship of (N)-Methanocarba phosphonate analogues of 5'-AMP as cardioprotective agents acting through a cardiac P2X receptor. J Med Chem 53:2562-76 (2010)  
Target
Name:
P2Y purinoceptor 1
Synonyms:
ATP receptor P2RY1_HUMAN P2Y1 Purinergic receptor P2Y1
Type:
Enzyme
Mol. Mass.:
42090.25
Organism:
Homo sapiens (Human)
Description:
P47900
Residue:
373
  
Inhibitor
Name:
BDBM50308552
Synonyms:
(1'S,2'R,3'S,4'R,5'S)-4-(6-Amino-2-chloro-9H-purin-9-yl)-1-[phosphoryloxymethyl]bicyclo[3.1.0]hexane-2,3-diol | CHEMBL603128
Type:
Small organic molecule
Emp. Form.:
C12H15ClN5O6P
Mol. Mass.:
391.704
SMILES:
Nc1nc(Cl)nc2n(cnc12)[C@@H]1[C@H]2C[C@]2(COP(O)(O)=O)[C@@H](O)[C@H]1O
: