Target
Non-lysosomal glucosylceramidase
Ligand
BDBM50308672
Substrate
Meas. Tech.
ChEMBL_607224 (CHEMBL1070064)
IC50
20±n/a nM
Citation
 van Scherpenzeel, Mvan den Berg, RJDonker-Koopman, WELiskamp, RMAerts, JMOverkleeft, HSPieters, RJ Nanomolar affinity, iminosugar-based chemical probes for specific labeling of lysosomal glucocerebrosidase. Bioorg Med Chem 18:267-73 (2010)  
Target
Name:
Non-lysosomal glucosylceramidase
Synonyms:
Beta-glucosidase GBA2_HUMAN SPG46
Type:
PROTEIN
Mol. Mass.:
104639.04
Organism:
Homo sapiens (Human)
Description:
ChEMBL_1435476
Residue:
927
  
Inhibitor
Name:
BDBM50308672
Synonyms:
CHEMBL590070 | N-(Propylamide-benzophenone)-1-deoxynojirimycin
Type:
Small organic molecule
Emp. Form.:
C26H30N2O7
Mol. Mass.:
482.5256
SMILES:
OC[C@@H]1[C@@H](O)[C@H](O)[C@@H](O)CN1CCCNC(=O)c1ccc(cc1)C(=O)c1ccc(OCC#C)cc1
: