Target
Secreted frizzled-related protein 1
Ligand
BDBM50308683
Substrate
Meas. Tech.
ChEMBL_607293 (CHEMBL1072835)
EC50
870±n/a nM
Citation
 Moore, WJKern, JCBhat, RBodine, PVFukyama, SKrishnamurthy, GMagolda, RLPitts, KStauffer, BTrybulski, EJ Modulation of Wnt signaling through inhibition of secreted frizzled-related protein I (sFRP-1) with N-substituted piperidinyl diphenylsulfonyl sulfonamides: part II. Bioorg Med Chem 18:190-201 (2010)  
Target
Name:
Secreted frizzled-related protein 1
Synonyms:
FRP SARP2 SFRP1_HUMAN
Type:
PROTEIN
Mol. Mass.:
35404.91
Organism:
Homo sapiens (Human)
Description:
ChEMBL_1363191
Residue:
314
  
Inhibitor
Name:
BDBM50308683
Synonyms:
CHEMBL589332 | N-[1-(3-Chlorobenzoyl)piperidin-4-yl]-5-(phenylsulfonyl)-2-(trifluoromethyl)benzenesulfonamide
Type:
Small organic molecule
Emp. Form.:
C25H22ClF3N2O5S2
Mol. Mass.:
587.031
SMILES:
FC(F)(F)c1ccc(cc1S(=O)(=O)NC1CCN(CC1)C(=O)c1cccc(Cl)c1)S(=O)(=O)c1ccccc1
: