Target
Secreted frizzled-related protein 1
Ligand
BDBM50308706
Substrate
Meas. Tech.
ChEMBL_607293 (CHEMBL1072835)
EC50
400±n/a nM
Citation
 Moore, WJKern, JCBhat, RBodine, PVFukyama, SKrishnamurthy, GMagolda, RLPitts, KStauffer, BTrybulski, EJ Modulation of Wnt signaling through inhibition of secreted frizzled-related protein I (sFRP-1) with N-substituted piperidinyl diphenylsulfonyl sulfonamides: part II. Bioorg Med Chem 18:190-201 (2010)  
Target
Name:
Secreted frizzled-related protein 1
Synonyms:
FRP SARP2 SFRP1_HUMAN
Type:
PROTEIN
Mol. Mass.:
35404.91
Organism:
Homo sapiens (Human)
Description:
ChEMBL_1363191
Residue:
314
  
Inhibitor
Name:
BDBM50308706
Synonyms:
4-Oxo-4-[4-({[5-(phenylsulfonyl)-2-(trifluoromethyl)-phenyl]sulfonyl}amino)piperidin-1-yl]butanoic acid | CHEMBL592454
Type:
Small organic molecule
Emp. Form.:
C22H23F3N2O7S2
Mol. Mass.:
548.552
SMILES:
OC(=O)CCC(=O)N1CCC(CC1)NS(=O)(=O)c1cc(ccc1C(F)(F)F)S(=O)(=O)c1ccccc1
: