Target
Phosphatidylinositol 4,5-bisphosphate 3-kinase catalytic subunit alpha isoform
Ligand
BDBM50308779
Substrate
Meas. Tech.
ChEMBL_607466 (CHEMBL1068071)
IC50
23.5±n/a nM
Citation
 Dehnhardt, CMVenkatesan, AMDelos Santos, EChen, ZSantos, OAyral-Kaloustian, SBrooijmans, NMallon, RHollander, IFeldberg, LLucas, JChaudhary, IYu, KGibbons, JAbraham, RMansour, TS Lead optimization of N-3-substituted 7-morpholinotriazolopyrimidines as dual phosphoinositide 3-kinase/mammalian target of rapamycin inhibitors: discovery of PKI-402. J Med Chem 53:798-810 (2010)  
Target
Name:
Phosphatidylinositol 4,5-bisphosphate 3-kinase catalytic subunit alpha isoform
Synonyms:
P42336 PI3-kinase subunit p110-alpha PIK3CA Phosphatidylinositol 3-kinase alpha (PI3Kalpha) Phosphatidylinositol 4,5-bisphosphate 3-kinase (PI3K) Phosphatidylinositol 4,5-bisphosphate 3-kinase catalytic subunit alpha (PI3Kalpha) Phosphatidylinositol 4,5-bisphosphate 3-kinase catalytic subunit alpha isoform (PI3-Ka) Phosphatidylinositol 4,5-bisphosphate 3-kinase catalytic subunit alpha isoform (PI3K p110alpha) Phosphatidylinositol 4,5-bisphosphate 3-kinase catalytic subunit alpha isoform (PI3K-alpha) Phosphatidylinositol 4,5-bisphosphate 3-kinase catalytic subunit alpha isoform (PI3Kalpha p110alpha) Phosphatidylinositol 4,5-bisphosphate 3-kinase catalytic subunit alpha isoform (PIK3CA) Phosphatidylinositol-4,5-bisphosphate 3-kinase catalytic subunit alpha isoform Phosphoinositide 3-Kinase (PI3K), alpha Chain A Phosphoinositide 3-kinases (PI3K) PtdIns-3-kinase p110 | p110 alpha
Type:
Enzyme Subunit
Mol. Mass.:
124294.87
Organism:
Homo sapiens (Human)
Description:
P42336
Residue:
1068
  
Inhibitor
Name:
BDBM50308779
Synonyms:
1-(4-Dimethylaminophenyl)-3-[4-(3-isopropyl-7-morpholin-4-yl-3H-[1,2,3]triazolo[4,5-d]pyrimidin-5-yl)phenyl]-urea | CHEMBL590578
Type:
Small organic molecule
Emp. Form.:
C26H31N9O2
Mol. Mass.:
501.5834
SMILES:
CC(C)n1nnc2c(nc(nc12)-c1ccc(NC(=O)Nc2ccc(cc2)N(C)C)cc1)N1CCOCC1
: