Target
Cytosolic phospholipase A2
Ligand
BDBM50085993
Substrate
Meas. Tech.
ChEMBL_611785 (CHEMBL1066442)
IC50
31±n/a nM
Citation
 Forster, LLudwig, JKaptur, MBovens, SElfringhoff, ASHoltfrerich, ALehr, M 1-Indol-1-yl-propan-2-ones and related heterocyclic compounds as dual inhibitors of cytosolic phospholipase A(2)alpha and fatty acid amide hydrolase. Bioorg Med Chem 18:945-52 (2010)  
Target
Name:
Cytosolic phospholipase A2
Synonyms:
CPLA2 PA24A_HUMAN PLA2G4A Phospholipase A2 | Phospholipase A2 group IVA
Type:
Protein
Mol. Mass.:
85219.30
Organism:
Homo sapiens (Human)
Description:
P47712
Residue:
749
  
Inhibitor
Name:
BDBM50085993
Synonyms:
(E)-N-(((2S,4R)-4-((biphenyl-2-ylmethyl)(isobutyl)amino)-1-(2-(2,4-difluorobenzoyl)benzoyl)pyrrolidin-2-yl)methyl)-3-(4-((Z)-(2,4-dioxothiazolidin-5-ylidene)methyl)phenyl)acrylamide N-{4-(Biphenyl-2-ylmethyl-isobutyl-amino)-1-[2-(2,4-difluoro-benzoyl)-benzoyl]-pyrrolidin-2-ylmethyl}-3-[4-(2,4-dioxo-thiazolidin-5-ylidenemethyl)-phenyl]-acrylamide
Type:
Small organic molecule
Emp. Form.:
C49H44F2N4O5S
Mol. Mass.:
838.959
SMILES:
CC(C)CN(Cc1ccccc1-c1ccccc1)[C@@H]1C[C@@H](CNC(=O)C=Cc2ccc(C=C3SC(O)=NC3=O)cc2)N(C1)C(=O)c1ccccc1C(=O)c1ccc(F)cc1F
: