Target
DNA (cytosine-5)-methyltransferase 3B
Ligand
BDBM11979
Substrate
Meas. Tech.
ChEMBL_612062 (CHEMBL1072867)
IC50
17000±n/a nM
Citation
 Kuck, DSingh, NLyko, FMedina-Franco, JL Novel and selective DNA methyltransferase inhibitors: Docking-based virtual screening and experimental evaluation. Bioorg Med Chem 18:822-9 (2010)  
Target
Name:
DNA (cytosine-5)-methyltransferase 3B
Synonyms:
DNM3B_HUMAN | DNMT3B
Type:
PROTEIN
Mol. Mass.:
95771.12
Organism:
Homo sapiens (Human)
Description:
ChEMBL_1473708
Residue:
853
  
Inhibitor
Name:
BDBM11979
Synonyms:
5-[(3-carboxy-4-hydroxyphenyl)methyl]-2-hydroxybenzoic acid MgrA inhibitor, 1 | chemical diversity library compound 4
Type:
Small organic molecule
Emp. Form.:
C15H12O6
Mol. Mass.:
288.2522
SMILES:
OC(=O)c1cc(Cc2ccc(O)c(c2)C(O)=O)ccc1O
: