Target
Integrin alpha-4
Ligand
BDBM50309095
Substrate
Meas. Tech.
ChEMBL_608124 (CHEMBL1074813)
IC50
0.140000±n/a nM
Citation
 Reger, TSZunic, JStock, NWang, BSmith, NDMunoz, BGreen, MDGardner, MFJames, JPChen, WAlves, KSi, QTreonze, KMLingham, RBMumford, RA Heterocycle-substituted proline dipeptides as potent VLA-4 antagonists. Bioorg Med Chem Lett 20:1173-6 (2010)  
Target
Name:
Integrin alpha-4
Synonyms:
CD49 antigen-like family member D CD49d antigen ITA4_HUMAN Integrin alpha-4 Integrin alpha-IV VLA-4 integrin alpha 4 precursor | integrin alpha-4 precursor
Type:
Membrane Protein
Mol. Mass.:
114897.35
Organism:
Homo sapiens (Human)
Description:
P13612
Residue:
1032
  
Inhibitor
Name:
BDBM50309095
Synonyms:
2-(1-(3-cyanophenylsulfonyl)-4-(3,5-dimethylpiperidin-1-yl)pyrrolidine-2-carboxamido)-3-(4-(3,5-dichloroisonicotinamido)phenyl)propanoic acid | CHEMBL589558
Type:
Small organic molecule
Emp. Form.:
C34H36Cl2N6O6S
Mol. Mass.:
727.657
SMILES:
CC1CC(C)CN(C1)C1CC(N(C1)S(=O)(=O)c1cccc(c1)C#N)C(=O)NC(Cc1ccc(NC(=O)c2c(Cl)cncc2Cl)cc1)C(O)=O
: