Target
2-5A-dependent ribonuclease
Ligand
BDBM50309130
Substrate
Meas. Tech.
ChEMBL_608469 (CHEMBL1065130)
EC50
2.5±n/a nM
Citation
 Nagaoka, KKitamura, YUeno, YKitade, Y 5'-O-Dephosphorylated 2',5'-oligoadenylate (2-5A) with 8-methyladenosine at the 2'-terminus activates human RNase L. Bioorg Med Chem Lett 20:1186-8 (2010)  
Target
Name:
2-5A-dependent ribonuclease
Synonyms:
2-5A-dependent RNase RN5A_HUMAN RNS4 Ribonuclease 4 | Ribonuclease L
Type:
PROTEIN
Mol. Mass.:
83534.35
Organism:
Homo sapiens (Human)
Description:
ChEMBL_164152
Residue:
741
  
Inhibitor
Name:
BDBM50309130
Synonyms:
CHEMBL591446 | {[(2R,3R,4R,5R)-4-[({[(2R,3R,4R,5R)-4-[({[(2R,3R,4R,5R)-4-[({[(2R,3S,4R,5R)-5-(6-amino-8-methyl-9H-purin-9-yl)-3,4-dihydroxyoxolan-2-yl]methoxy}(hydroxy)phosphoryl)oxy]-5-(6-amino-9H-purin-9-yl)-3-hydroxyoxolan-2-yl]methoxy}(hydroxy)phosphoryl)oxy]-5-(6-amino-9H-purin-9-yl)-3-hydroxyoxolan-2-yl]methoxy}(hydroxy)phosphoryl)oxy]-5-(6-amino-9H-purin-9-yl)-3-hydroxyoxolan-2-yl]methoxy}phosphonic acid
Type:
Small organic molecule
Emp. Form.:
C41H52N20O25P4
Mol. Mass.:
1348.8656
SMILES:
Cc1nc2c(N)ncnc2n1[C@@H]1O[C@H](COP(O)(=O)O[C@@H]2[C@H](O)[C@@H](COP(O)(=O)O[C@@H]3[C@H](O)[C@@H](COP(O)(=O)O[C@@H]4[C@H](O)[C@@H](COP(O)(O)=O)O[C@H]4n4cnc5c(N)ncnc45)O[C@H]3n3cnc4c(N)ncnc34)O[C@H]2n2cnc3c(N)ncnc23)[C@@H](O)[C@H]1O
: