Target
5-hydroxytryptamine receptor 2B
Ligand
BDBM50309338
Substrate
Meas. Tech.
ChEMBL_609155 (CHEMBL1066138)
Ki
18±n/a nM
Citation
 Ahmad, SNgu, KMiller, KJWu, GHung, CPMalmstrom, SZhang, GO'Tanyi, EKeim, WJCullen, MJRohrbach, KWThomas, MUng, TQu, QGan, JNarayanan, RPelleymounter, MARobl, JA Tricyclic dihydroquinazolinones as novel 5-HT2C selective and orally efficacious anti-obesity agents. Bioorg Med Chem Lett 20:1128-33 (2010)  
Target
Name:
5-hydroxytryptamine receptor 2B
Synonyms:
5-HT-2B 5-hydroxytryptamine (serotonin) receptor 2B [Homo sapiens] 5-hydroxytryptamine receptor 2C (5HT2C) HTR2B Serotonin 2b (5-HT2b) receptor | Serotonin Receptor 2B
Type:
G Protein-Coupled Receptor (GPCR)
Mol. Mass.:
54312.47
Organism:
Homo sapiens (Human)
Description:
Receptor binding assays were performed using human clone stably expressed in CHO cells.
Residue:
481
  
Inhibitor
Name:
BDBM50309338
Synonyms:
7-chloro-3,4,4a,5-tetrahydro-1H-pyrazino[1,2-a]quinazolin-6(2H)-one | CHEMBL605402
Type:
Small organic molecule
Emp. Form.:
C11H12ClN3O
Mol. Mass.:
237.685
SMILES:
Clc1cccc2N3CCNCC3NC(=O)c12
: