Target
5-hydroxytryptamine receptor 2C
Ligand
BDBM50309342
Substrate
Meas. Tech.
ChEMBL_609151 (CHEMBL1067825)
Ki
49±n/a nM
Citation
 Ahmad, SNgu, KMiller, KJWu, GHung, CPMalmstrom, SZhang, GO'Tanyi, EKeim, WJCullen, MJRohrbach, KWThomas, MUng, TQu, QGan, JNarayanan, RPelleymounter, MARobl, JA Tricyclic dihydroquinazolinones as novel 5-HT2C selective and orally efficacious anti-obesity agents. Bioorg Med Chem Lett 20:1128-33 (2010)  
Target
Name:
5-hydroxytryptamine receptor 2C
Synonyms:
5-HT-2C 5-HT2C-INI 5-HTR2C 5-hydroxytryptamine receptor 2C (5-HT-2C) 5HT-1C HTR1C Serotonin (5-HT3) receptor Serotonin Receptor 2C
Type:
G Protein-Coupled Receptor (GPCR)
Mol. Mass.:
51836.79
Organism:
Homo sapiens (Human)
Description:
P28335
Residue:
458
  
Inhibitor
Name:
BDBM50309342
Synonyms:
2,3,4,5,5a,6-hexahydro-[1,4]diazepino[1,7-a]quinazolin-7(1H)-one | CHEMBL590816
Type:
Small organic molecule
Emp. Form.:
C12H15N3O
Mol. Mass.:
217.267
SMILES:
O=C1NC2CCNCCN2c2ccccc12
: