Target
5-hydroxytryptamine receptor 2A
Ligand
BDBM50309343
Substrate
Meas. Tech.
ChEMBL_609158 (CHEMBL1066141)
Ki
141±n/a nM
Citation
 Ahmad, SNgu, KMiller, KJWu, GHung, CPMalmstrom, SZhang, GO'Tanyi, EKeim, WJCullen, MJRohrbach, KWThomas, MUng, TQu, QGan, JNarayanan, RPelleymounter, MARobl, JA Tricyclic dihydroquinazolinones as novel 5-HT2C selective and orally efficacious anti-obesity agents. Bioorg Med Chem Lett 20:1128-33 (2010)  
Target
Name:
5-hydroxytryptamine receptor 2A
Synonyms:
5-HT-2 5-HT2A 5-hydroxytryptamine receptor 2A (5HT-2A) 5HT2A_HUMAN HTR2A | Serotonin receptor 2A
Type:
undefined
Mol. Mass.:
52607.65
Organism:
Homo sapiens (Human)
Description:
P28223
Residue:
471
  
Inhibitor
Name:
BDBM50309343
Synonyms:
8-methyl-2,3,4,5,5a,6-hexahydro-[1,4]diazepino[1,7-a]quinazolin-7(1H)-one | CHEMBL590580
Type:
Small organic molecule
Emp. Form.:
C13H17N3O
Mol. Mass.:
231.2936
SMILES:
Cc1cccc2N3CCNCCC3NC(=O)c12
: