Target
Phospholipase A-2-activating protein
Ligand
BDBM21974
Substrate
Meas. Tech.
ChEMBL_610122 (CHEMBL1074487)
IC50
>5000±n/a nM
Citation
 Lanier, MSergienko, ESimão, AMSu, YChung, TMillán, JLCashman, JR Design and synthesis of selective inhibitors of placental alkaline phosphatase. Bioorg Med Chem 18:573-9 (2010)  
Target
Name:
Phospholipase A-2-activating protein
Synonyms:
PLAA PLAP_HUMAN
Type:
PROTEIN
Mol. Mass.:
87154.11
Organism:
Homo sapiens (Human)
Description:
ChEMBL_610122
Residue:
795
  
Inhibitor
Name:
BDBM21974
Synonyms:
(2S)-2-amino-3-(1H-indol-3-yl)propanoic acid L-tryptophan US9138393, L-Tryptophan | US9144538, L-Tryptophan
Type:
Amino Acid
Emp. Form.:
C11H12N2O2
Mol. Mass.:
204.2252
SMILES:
N[C@@H](Cc1c[nH]c2ccccc12)C(O)=O
: