Target
Cannabinoid receptor 1
Ligand
BDBM50309983
Substrate
Meas. Tech.
ChEMBL_612189 (CHEMBL1074127)
IC50
74.8±n/a nM
Citation
 Seo, HJKim, MJLee, SHLee, SHJung, MEKim, MSAhn, KKim, JLee, J Synthesis and structure-activity relationship of 1,2,4-triazole-containing diarylpyrazolyl carboxamide as CB1 cannabinoid receptor-ligand. Bioorg Med Chem 18:1149-62 (2010)  
Target
Name:
Cannabinoid receptor 1
Synonyms:
Brain-type cannabinoid receptor CB-R CNR1_RAT Cannabinoid receptor Cnr1 | Skr6
Type:
G Protein-Coupled Receptor (GPCR)
Mol. Mass.:
52856.55
Organism:
Rattus norvegicus (rat)
Description:
P20272
Residue:
473
  
Inhibitor
Name:
BDBM50309983
Synonyms:
4-((1H-1,2,4-Triazol-1-yl)methyl)-5-(4-chlorophenyl)-1-(2,4-dichlorophenyl)-N-(pyridin-2-ylmethyl)-1H-pyrazole-3-carboxamide | CHEMBL609267
Type:
Small organic molecule
Emp. Form.:
C25H18Cl3N7O
Mol. Mass.:
538.816
SMILES:
Clc1ccc(cc1)-c1c(Cn2cncn2)c(nn1-c1ccc(Cl)cc1Cl)C(=O)NCc1ccccn1
: