Target
Cannabinoid receptor 1
Ligand
BDBM50309990
Substrate
Meas. Tech.
ChEMBL_612189 (CHEMBL1074127)
IC50
5.81±n/a nM
Citation
 Seo, HJKim, MJLee, SHLee, SHJung, MEKim, MSAhn, KKim, JLee, J Synthesis and structure-activity relationship of 1,2,4-triazole-containing diarylpyrazolyl carboxamide as CB1 cannabinoid receptor-ligand. Bioorg Med Chem 18:1149-62 (2010)  
Target
Name:
Cannabinoid receptor 1
Synonyms:
Brain-type cannabinoid receptor CB-R CNR1_RAT Cannabinoid receptor Cnr1 | Skr6
Type:
G Protein-Coupled Receptor (GPCR)
Mol. Mass.:
52856.55
Organism:
Rattus norvegicus (rat)
Description:
P20272
Residue:
473
  
Inhibitor
Name:
BDBM50309990
Synonyms:
4-((1H-1,2,4-Triazol-1-yl)methyl)-1-(2-chlorophenyl)-5-(4-chlorophenyl)-N-(1-phenylcyclopropyl)-1H-pyrazole-3-carboxamide | CHEMBL603455
Type:
Small organic molecule
Emp. Form.:
C28H22Cl2N6O
Mol. Mass.:
529.42
SMILES:
Clc1ccc(cc1)-c1c(Cn2cncn2)c(nn1-c1ccccc1Cl)C(=O)NC1(CC1)c1ccccc1
: