Target
Cannabinoid receptor 1
Ligand
BDBM50310002
Substrate
Meas. Tech.
ChEMBL_612189 (CHEMBL1074127)
IC50
1.98±n/a nM
Citation
 Seo, HJKim, MJLee, SHLee, SHJung, MEKim, MSAhn, KKim, JLee, J Synthesis and structure-activity relationship of 1,2,4-triazole-containing diarylpyrazolyl carboxamide as CB1 cannabinoid receptor-ligand. Bioorg Med Chem 18:1149-62 (2010)  
Target
Name:
Cannabinoid receptor 1
Synonyms:
Brain-type cannabinoid receptor CB-R CNR1_RAT Cannabinoid receptor Cnr1 | Skr6
Type:
G Protein-Coupled Receptor (GPCR)
Mol. Mass.:
52856.55
Organism:
Rattus norvegicus (rat)
Description:
P20272
Residue:
473
  
Inhibitor
Name:
BDBM50310002
Synonyms:
4-((1H-1,2,4-Triazol-1-yl)methyl)-5-(4-bromophenyl)-1-(2-chlorophenyl)-N-(1-phenylcyclopropyl)-1H-pyrazole-3-carboxamide | CHEMBL597337
Type:
Small organic molecule
Emp. Form.:
C28H22BrClN6O
Mol. Mass.:
573.871
SMILES:
Clc1ccccc1-n1nc(C(=O)NC2CC2c2ccccc2)c(Cn2cncn2)c1-c1ccc(Br)cc1
: