Target
Cannabinoid receptor 1
Ligand
BDBM50310012
Substrate
Meas. Tech.
ChEMBL_612189 (CHEMBL1074127)
IC50
27.7±n/a nM
Citation
 Seo, HJKim, MJLee, SHLee, SHJung, MEKim, MSAhn, KKim, JLee, J Synthesis and structure-activity relationship of 1,2,4-triazole-containing diarylpyrazolyl carboxamide as CB1 cannabinoid receptor-ligand. Bioorg Med Chem 18:1149-62 (2010)  
Target
Name:
Cannabinoid receptor 1
Synonyms:
Brain-type cannabinoid receptor CB-R CNR1_RAT Cannabinoid receptor Cnr1 | Skr6
Type:
G Protein-Coupled Receptor (GPCR)
Mol. Mass.:
52856.55
Organism:
Rattus norvegicus (rat)
Description:
P20272
Residue:
473
  
Inhibitor
Name:
BDBM50310012
Synonyms:
(4-((1H-1,2,4-Triazol-1-yl)methyl)-5-(4-bromophenyl)-1-(2,4-dichlorophenyl)-1H-pyrazol-3-yl)(4-(pyrimidin-2-yl)piperazin-1-yl)methanone | CHEMBL603663
Type:
Small organic molecule
Emp. Form.:
C27H22BrCl2N9O
Mol. Mass.:
639.333
SMILES:
Clc1ccc(c(Cl)c1)-n1nc(C(=O)N2CCN(CC2)c2ncccn2)c(Cn2cncn2)c1-c1ccc(Br)cc1
: