Target
Cannabinoid receptor 1
Ligand
BDBM50310053
Substrate
Meas. Tech.
ChEMBL_612189 (CHEMBL1074127)
IC50
8.23±n/a nM
Citation
 Seo, HJKim, MJLee, SHLee, SHJung, MEKim, MSAhn, KKim, JLee, J Synthesis and structure-activity relationship of 1,2,4-triazole-containing diarylpyrazolyl carboxamide as CB1 cannabinoid receptor-ligand. Bioorg Med Chem 18:1149-62 (2010)  
Target
Name:
Cannabinoid receptor 1
Synonyms:
Brain-type cannabinoid receptor CB-R CNR1_RAT Cannabinoid receptor Cnr1 | Skr6
Type:
G Protein-Coupled Receptor (GPCR)
Mol. Mass.:
52856.55
Organism:
Rattus norvegicus (rat)
Description:
P20272
Residue:
473
  
Inhibitor
Name:
BDBM50310053
Synonyms:
4-((1H-1,2,4-Triazol-1-yl)methyl)-N-(azepan-1-yl)-5-(4-bromophenyl)-1-(2,4-dichlorophenyl)-1H-pyrazole-3-carboxamide | CHEMBL605560
Type:
Small organic molecule
Emp. Form.:
C25H23BrCl2N6O
Mol. Mass.:
574.3
SMILES:
Clc1ccc(c(Cl)c1)-n1nc(C(=O)N2CCCCCC2)c(Cn2cncn2)c1-c1ccc(Br)cc1
: