Target
Fructose-1,6-bisphosphatase 1
Ligand
BDBM50310083
Substrate
Meas. Tech.
ChEMBL_612215 (CHEMBL1074153)
IC50
8±n/a nM
Citation
 Tsukada, TTakahashi, MTakemoto, TKanno, OYamane, TKawamura, SNishi, T Structure-based drug design of tricyclic 8H-indeno[1,2-d][1,3]thiazoles as potent FBPase inhibitors. Bioorg Med Chem Lett 20:1004-7 (2010)  
Target
Name:
Fructose-1,6-bisphosphatase 1
Synonyms:
D-fructose-1,6-bisphosphate 1-phosphohydrolase 1 FBP FBPase 1 Fructose-1,6-bisphosphatase 1 | Fructose-1,6-bisphosphatase 1 (FBPase)
Type:
Protein
Mol. Mass.:
36843.58
Organism:
Homo sapiens (Human)
Description:
Liver FBPase (P09467)
Residue:
338
  
Inhibitor
Name:
BDBM50310083
Synonyms:
(7-methyl-8H-indeno[1,2-d]thiazol-4-yloxy)methylphosphonic acid | CHEMBL597282
Type:
Small organic molecule
Emp. Form.:
C12H12NO4PS
Mol. Mass.:
297.267
SMILES:
Cc1ccc(OCP(O)(O)=O)c-2c1Cc1scnc-21
: