Target
Fructose-1,6-bisphosphatase 1
Ligand
BDBM50293594
Substrate
Meas. Tech.
ChEMBL_612215 (CHEMBL1074153)
IC50
10±n/a nM
Citation
 Tsukada, TTakahashi, MTakemoto, TKanno, OYamane, TKawamura, SNishi, T Structure-based drug design of tricyclic 8H-indeno[1,2-d][1,3]thiazoles as potent FBPase inhibitors. Bioorg Med Chem Lett 20:1004-7 (2010)  
Target
Name:
Fructose-1,6-bisphosphatase 1
Synonyms:
D-fructose-1,6-bisphosphate 1-phosphohydrolase 1 FBP FBPase 1 Fructose-1,6-bisphosphatase 1 | Fructose-1,6-bisphosphatase 1 (FBPase)
Type:
Protein
Mol. Mass.:
36843.58
Organism:
Homo sapiens (Human)
Description:
Liver FBPase (P09467)
Residue:
338
  
Inhibitor
Name:
BDBM50293594
Synonyms:
5-(2-amino-5-isobutylthiazol-4-yl)furan-2-ylphosphonic acid | CHEMBL495498
Type:
Small organic molecule
Emp. Form.:
C11H15N2O4PS
Mol. Mass.:
302.287
SMILES:
CC(C)Cc1sc(N)nc1-c1ccc(o1)P(O)(O)=O
: