Target
Amine oxidase [flavin-containing] B
Ligand
BDBM7460
Substrate
Meas. Tech.
ChEMBL_612780 (CHEMBL1071606)
IC50
90000±n/a nM
Citation
 Chimenti, FFioravanti, RBolasco, AChimenti, PSecci, DRossi, FYáñez, MOrallo, FOrtuso, FAlcaro, SCirilli, RFerretti, RSanna, ML A new series of flavones, thioflavones, and flavanones as selective monoamine oxidase-B inhibitors. Bioorg Med Chem 18:1273-9 (2010)  
Target
Name:
Amine oxidase [flavin-containing] B
Synonyms:
AOFB_HUMAN MAOB Monoamine oxidase type B (MAO B) Monoamine oxidase type B (MAOB)
Type:
Protein
Mol. Mass.:
58768.76
Organism:
Homo sapiens (Human)
Description:
P27338
Residue:
520
  
Inhibitor
Name:
BDBM7460
Synonyms:
2-(3,4-dihydroxyphenyl)-3,5,7-trihydroxy-4H-chromen-4-one 2-(3,4-dihydroxyphenyl)-3,5,7-trihydroxy-chromone;hydrate Quercetin Quercetin (21) US11021454, Compound Quercetin med.21724, Compound 4
Type:
Small organic molecule
Emp. Form.:
C15H10O7
Mol. Mass.:
302.2357
SMILES:
Oc1cc(O)c2c(c1)oc(-c1ccc(O)c(O)c1)c(O)c2=O
: