Target
Antithrombin-III
Ligand
BDBM50310299
Substrate
Meas. Tech.
ChEMBL_607976 (CHEMBL1072392)
IC50
>300000±n/a nM
Citation
 El-Ayache, NCLi, SHWarnock, MLawrence, DAEmal, CD Novel bis-arylsulfonamides and aryl sulfonimides as inactivators of plasminogen activator inhibitor-1 (PAI-1). Bioorg Med Chem Lett 20:966-70 (2010)  
Target
Name:
Antithrombin-III
Synonyms:
ANT3_HUMAN ATIII Antithrombin-III precursor SERPINC1
Type:
PROTEIN
Mol. Mass.:
52602.34
Organism:
Homo sapiens (Human)
Description:
ChEMBL_35871
Residue:
464
  
Inhibitor
Name:
BDBM50310299
Synonyms:
CHEMBL599342 | N,N'-(ethane-1,2-diyl)bis(N-ethyl-3,4-dimethoxybenzenesulfonamide)
Type:
Small organic molecule
Emp. Form.:
C22H32N2O8S2
Mol. Mass.:
516.628
SMILES:
CCN(CCN(CC)S(=O)(=O)c1ccc(OC)c(OC)c1)S(=O)(=O)c1ccc(OC)c(OC)c1
: