Target
cAMP-dependent protein kinase catalytic subunit alpha
Ligand
BDBM50168588
Substrate
Meas. Tech.
ChEMBL_619399 (CHEMBL1104157)
Ki
960±n/a nM
Citation
 Bandarage, UHare, BParsons, JPham, LMarhefka, CBemis, GTang, QMoody, CSRodems, SShah, SAdams, CBravo, JCharonnet, ESavic, VCome, JHGreen, J 4-(Benzimidazol-2-yl)-1,2,5-oxadiazol-3-ylamine derivatives: potent and selective p70S6 kinase inhibitors. Bioorg Med Chem Lett 19:5191-4 (2009)  
Target
Name:
cAMP-dependent protein kinase catalytic subunit alpha
Synonyms:
KAPCA_HUMAN PKACA cAMP-dependent protein kinase (PKA) cAMP-dependent protein kinase catalytic subunit alpha cAMP-dependent protein kinase catalytic subunit alpha (PKACA) cAMP-dependent protein kinase catalytic subunit alpha isoform 1 | cAMP-dependent protein kinase, alpha-catalytic subunit
Type:
Enzyme Catalytic Subunit
Mol. Mass.:
40598.73
Organism:
Homo sapiens (Human)
Description:
Residue:
351
  
Inhibitor
Name:
BDBM50168588
Synonyms:
4-(1-Ethyl-1H-benzoimidazol-2-yl)-furazan-3-ylamine CHEMBL365286
Type:
Small organic molecule
Emp. Form.:
C11H11N5O
Mol. Mass.:
229.2379
SMILES:
CCn1c(nc2ccccc12)-c1nonc1N
: