Target
Ribosomal protein S6 kinase beta-1
Ligand
BDBM50310465
Substrate
Meas. Tech.
ChEMBL_619398 (CHEMBL1104156)
Ki
800±n/a nM
Citation
 Bandarage, UHare, BParsons, JPham, LMarhefka, CBemis, GTang, QMoody, CSRodems, SShah, SAdams, CBravo, JCharonnet, ESavic, VCome, JHGreen, J 4-(Benzimidazol-2-yl)-1,2,5-oxadiazol-3-ylamine derivatives: potent and selective p70S6 kinase inhibitors. Bioorg Med Chem Lett 19:5191-4 (2009)  
Target
Name:
Ribosomal protein S6 kinase beta-1
Synonyms:
70 kDa ribosomal protein S6 kinase 1 70 kDa ribosomal protein kinase (p70S6K) Protein kinase 70S6K (T412E) RPS6KB1 Ribosomal protein S6 kinase I STK14A p70S6K1
Type:
Enzyme
Mol. Mass.:
59139.89
Organism:
Homo sapiens (Human)
Description:
His-tagged S6K1.
Residue:
525
  
Inhibitor
Name:
BDBM50310465
Synonyms:
4-(2-(4-amino-1,2,5-oxadiazol-3-yl)-1H-benzo[d]imidazol-1-yl)benzonitrile | CHEMBL1078538
Type:
Small organic molecule
Emp. Form.:
C16H10N6O
Mol. Mass.:
302.2902
SMILES:
Nc1nonc1-c1nc2ccccc2n1-c1ccc(cc1)C#N
: