Target
cAMP-dependent protein kinase catalytic subunit alpha
Ligand
BDBM50310465
Substrate
Meas. Tech.
ChEMBL_619399 (CHEMBL1104157)
Ki
>5000±n/a nM
Citation
 Bandarage, UHare, BParsons, JPham, LMarhefka, CBemis, GTang, QMoody, CSRodems, SShah, SAdams, CBravo, JCharonnet, ESavic, VCome, JHGreen, J 4-(Benzimidazol-2-yl)-1,2,5-oxadiazol-3-ylamine derivatives: potent and selective p70S6 kinase inhibitors. Bioorg Med Chem Lett 19:5191-4 (2009)  
Target
Name:
cAMP-dependent protein kinase catalytic subunit alpha
Synonyms:
KAPCA_HUMAN PKACA cAMP-dependent protein kinase (PKA) cAMP-dependent protein kinase catalytic subunit alpha cAMP-dependent protein kinase catalytic subunit alpha (PKACA) cAMP-dependent protein kinase catalytic subunit alpha isoform 1 | cAMP-dependent protein kinase, alpha-catalytic subunit
Type:
Enzyme Catalytic Subunit
Mol. Mass.:
40598.73
Organism:
Homo sapiens (Human)
Description:
Residue:
351
  
Inhibitor
Name:
BDBM50310465
Synonyms:
4-(2-(4-amino-1,2,5-oxadiazol-3-yl)-1H-benzo[d]imidazol-1-yl)benzonitrile | CHEMBL1078538
Type:
Small organic molecule
Emp. Form.:
C16H10N6O
Mol. Mass.:
302.2902
SMILES:
Nc1nonc1-c1nc2ccccc2n1-c1ccc(cc1)C#N
: