Target
Proto-oncogene tyrosine-protein kinase receptor Ret
Ligand
BDBM50310637
Substrate
Meas. Tech.
ChEMBL_620394 (CHEMBL1112289)
Kd
4.7±n/a nM
Citation
 Patel, HKGrotzfeld, RMLai, AGMehta, SAMilanov, ZVChao, QSprankle, KGCarter, TAVelasco, AMFabian, MAJames, JTreiber, DKLockhart, DJZarrinkar, PPBhagwat, SS Arylcarboxyamino-substituted diaryl ureas as potent and selective FLT3 inhibitors. Bioorg Med Chem Lett 19:5182-5 (2009)  
Target
Name:
Proto-oncogene tyrosine-protein kinase receptor Ret
Synonyms:
CDHF12 Cadherin family member 12 Proto-oncogene c-Ret RET51 Tyrosine-protein kinase Ret (RET)
Type:
Protein
Mol. Mass.:
124318.29
Organism:
Homo sapiens (Human)
Description:
P07949
Residue:
1114
  
Inhibitor
Name:
BDBM50310637
Synonyms:
CHEMBL1079545 | N-(4-(3-(5-tert-butylisoxazol-3-yl)ureido)phenyl)-3-hydroxypicolinamide
Type:
Small organic molecule
Emp. Form.:
C20H21N5O4
Mol. Mass.:
395.4118
SMILES:
CC(C)(C)c1cc(NC(=O)Nc2ccc(NC(=O)c3ncccc3O)cc2)no1
: