Target
Procathepsin L
Ligand
BDBM50310690
Substrate
Meas. Tech.
ChEMBL_621093 (CHEMBL1113177)
IC50
5400±n/a nM
Citation
 Guay, DBeaulieu, CTruchon, JFJagadeeswar Reddy, TZamboni, RBayly, CIMethot, NRubin, JEthier, DDavid Percival, M Design and synthesis of dipeptidyl nitriles as potent, selective, and reversible inhibitors of cathepsin C. Bioorg Med Chem Lett 19:5392-6 (2009)  
Target
Name:
Procathepsin L
Synonyms:
CATL1_HUMAN CTSL CTSL1 Cathepsin L Cathepsin L1 heavy chain MEP cathepsin L preproprotein
Type:
Enzyme
Mol. Mass.:
37557.19
Organism:
Homo sapiens (Human)
Description:
Purchased from Calbiochem (San Diego, CA).
Residue:
333
  
Inhibitor
Name:
BDBM50310690
Synonyms:
CHEMBL1078411 | Cis-(S)-2-amino-N-((1R,2R)-1-cyano-2-phenylcyclopropyl)-3-(thiophen-2-yl)propanamide
Type:
Small organic molecule
Emp. Form.:
C17H17N3OS
Mol. Mass.:
311.401
SMILES:
N[C@@H](Cc1cccs1)C(=O)N[C@@]1(C[C@@H]1c1ccccc1)C#N
: