Target
GABA-A receptor; alpha-5/beta-3/gamma-2
Ligand
BDBM50144861
Substrate
Meas. Tech.
ChEMBL_623168 (CHEMBL1111448)
Ki
1.5±n/a nM
Citation
 Buettelmann, BBallard, TMGasser, RFischer, HHernandez, MCKnoflach, FKnust, HStadler, HThomas, AWTrube, G Imidazo[1,5-a][1,2,4]-triazolo[1,5-d][1,4]benzodiazepines as potent and highly selective GABAA alpha5 inverse agonists with potential for the treatment of cognitive dysfunction. Bioorg Med Chem Lett 19:5958-61 (2009)  
Target
Name:
GABA-A receptor; alpha-5/beta-3/gamma-2
Synonyms:
GABA receptor alpha-5/beta-3/gamma-2 subunit | Gamma-aminobutyric acid receptor subunit alpha-5/beta-3/gamma-2
Type:
Mol. Mass.:
Description:
ASSAY_ID of ChEMBL is 2148177
Components:
This complex has 3 components.
Component 1
Name:
Gamma-aminobutyric acid receptor subunit gamma-2
Synonyms:
GABA(A) receptor subunit gamma-2 GBRG2_HUMAN
Type:
PROTEIN
Mol. Mass.:
54172.74
Organism:
Homo sapiens (Human)
Description:
EBI_217
Residue:
467
  
Component 2
Name:
Gamma-aminobutyric acid receptor subunit beta-3
Synonyms:
GABA A receptor alpha-4/beta-3/gamma-2 GABA-A receptor GBRB3_HUMAN | agonist GABA site
Type:
PROTEIN
Mol. Mass.:
54130.51
Organism:
Homo sapiens (Human)
Description:
ChEMBL_448071
Residue:
473
  
Component 3
Name:
Gamma-aminobutyric acid receptor subunit alpha-5
Synonyms:
GABA receptor alpha-5 subunit GABRA5 Gamma-aminobutyric acid receptor subunit alpha-5 (GABA(A)) | Gamma-aminobutyric acid receptor subunit alpha-5 (GABAA)
Type:
Enzyme
Mol. Mass.:
52160.59
Organism:
Homo sapiens (Human)
Description:
P31644
Residue:
462
  
Inhibitor
Name:
BDBM50144861
Synonyms:
3-(5-Methyl-isoxazol-3-yl)-6-(pyridin-2-ylmethoxy)-[1,2,4]triazolo[3,4-a]phthalazine CHEMBL68684
Type:
Small organic molecule
Emp. Form.:
C19H14N6O2
Mol. Mass.:
358.3535
SMILES:
Cc1cc(no1)-c1nnc2c3ccccc3c(OCc3ccccn3)nn12
: