Target
Tyrosine-protein kinase JAK2
Ligand
BDBM50310992
Substrate
Meas. Tech.
ChEMBL_619477 (CHEMBL1107753)
IC50
326±n/a nM
Citation
 Burns, CJBourke, DGAndrau, LBu, XCharman, SADonohue, ACFantino, EFarrugia, MFeutrill, JTJoffe, MKling, MRKurek, MNero, TLNguyen, TPalmer, JTPhillips, IShackleford, DMSikanyika, HStyles, MSu, STreutlein, HZeng, JWilks, AF Phenylaminopyrimidines as inhibitors of Janus kinases (JAKs). Bioorg Med Chem Lett 19:5887-92 (2009)  
Target
Name:
Tyrosine-protein kinase JAK2
Synonyms:
JAK-2 JAK2_HUMAN Janus kinase 2 (JAK2) | Janus kinase 2 (a protein tyrosine kinase)
Type:
Protein
Mol. Mass.:
130684.68
Organism:
Homo sapiens (Human)
Description:
O60674
Residue:
1132
  
Inhibitor
Name:
BDBM50310992
Synonyms:
4-(2-(4-morpholinophenylamino)pyrimidin-4-yl)benzamide | CHEMBL1080395
Type:
Small organic molecule
Emp. Form.:
C21H21N5O2
Mol. Mass.:
375.4237
SMILES:
NC(=O)c1ccc(cc1)-c1ccnc(Nc2ccc(cc2)N2CCOCC2)n1
: