Target
Tyrosine-protein kinase JAK2
Ligand
BDBM50311032
Substrate
Meas. Tech.
ChEMBL_619477 (CHEMBL1107753)
IC50
41±n/a nM
Citation
 Burns, CJBourke, DGAndrau, LBu, XCharman, SADonohue, ACFantino, EFarrugia, MFeutrill, JTJoffe, MKling, MRKurek, MNero, TLNguyen, TPalmer, JTPhillips, IShackleford, DMSikanyika, HStyles, MSu, STreutlein, HZeng, JWilks, AF Phenylaminopyrimidines as inhibitors of Janus kinases (JAKs). Bioorg Med Chem Lett 19:5887-92 (2009)  
Target
Name:
Tyrosine-protein kinase JAK2
Synonyms:
JAK-2 JAK2_HUMAN Janus kinase 2 (JAK2) | Janus kinase 2 (a protein tyrosine kinase)
Type:
Protein
Mol. Mass.:
130684.68
Organism:
Homo sapiens (Human)
Description:
O60674
Residue:
1132
  
Inhibitor
Name:
BDBM50311032
Synonyms:
CHEMBL1078934 | N-(cyanomethyl)-4-(2-(4-(4-methylpiperazin-1-yl)phenylamino)pyrimidin-4-yl)benzamide
Type:
Small organic molecule
Emp. Form.:
C24H25N7O
Mol. Mass.:
427.5016
SMILES:
CN1CCN(CC1)c1ccc(Nc2nccc(n2)-c2ccc(cc2)C(=O)NCC#N)cc1
: