Target
Tyrosine-protein kinase JAK1
Ligand
BDBM50311017
Substrate
Meas. Tech.
ChEMBL_619489 (CHEMBL1108560)
IC50
11±n/a nM
Citation
 Burns, CJBourke, DGAndrau, LBu, XCharman, SADonohue, ACFantino, EFarrugia, MFeutrill, JTJoffe, MKling, MRKurek, MNero, TLNguyen, TPalmer, JTPhillips, IShackleford, DMSikanyika, HStyles, MSu, STreutlein, HZeng, JWilks, AF Phenylaminopyrimidines as inhibitors of Janus kinases (JAKs). Bioorg Med Chem Lett 19:5887-92 (2009)  
Target
Name:
Tyrosine-protein kinase JAK1
Synonyms:
JAK-1 JAK1A JAK1_HUMAN Janus kinase 1 (JAK1) | Janus kinase 1 JAK1
Type:
Protein
Mol. Mass.:
133293.73
Organism:
Homo sapiens (Human)
Description:
P23458
Residue:
1154
  
Inhibitor
Name:
BDBM50311017
Synonyms:
CHEMBL1078178 N-(cyanomethyl)-4-(2-(4-morpholinophenylamino)pyrimidin-4-yl)benzamide US10766894, Compound TABLE 1.4 US9469613, CYT-0387
Type:
Small organic molecule
Emp. Form.:
C23H22N6O2
Mol. Mass.:
414.4598
SMILES:
O=C(NCC#N)c1ccc(cc1)-c1ccnc(Nc2ccc(cc2)N2CCOCC2)n1
: