Target
A disintegrin and metalloproteinase with thrombospondin motifs 5
Ligand
BDBM50311080
Substrate
Meas. Tech.
ChEMBL_619828 (CHEMBL1106705)
IC50
60±n/a nM
Citation
 Shiozaki, MImai, HMaeda, KMiura, TYasue, KSuma, AYokota, MOgoshi, YHaas, JFryer, AMLaird, ERLittmann, NMAndrews, SWJosey, JAMimura, TShinozaki, YYoshiuchi, HInaba, T Synthesis and SAR of 2-phenyl-1-sulfonylaminocyclopropane carboxylates as ADAMTS-5 (Aggrecanase-2) inhibitors. Bioorg Med Chem Lett 19:6213-7 (2009)  
Target
Name:
A disintegrin and metalloproteinase with thrombospondin motifs 5
Synonyms:
A disintegrin and metalloproteinase with thrombospondin motifs 5 (ADAMTS-5) ADAMTS5 ATS5_HUMAN Metalloproteinase with thrombospondin motifs 5 (ADAMTS-5)
Type:
Enzyme
Mol. Mass.:
101769.09
Organism:
Homo sapiens (Human)
Description:
Q9UNA0
Residue:
930
  
Inhibitor
Name:
BDBM50311080
Synonyms:
(1S,2R)-1-(5-(4-chlorophenyl)thiophene-2-sulfonamido)-2-phenylcyclopropanecarboxylic acid US10322143, Shiozaki Compound 5
Type:
Small organic molecule
Emp. Form.:
C20H16ClNO4S2
Mol. Mass.:
433.928
SMILES:
OC(=O)[C@@]1(C[C@@H]1c1ccccc1)NS(=O)(=O)c1ccc(s1)-c1ccc(Cl)cc1
: