Target
Disintegrin and metalloproteinase domain-containing protein 17
Ligand
BDBM50311088
Substrate
Meas. Tech.
ChEMBL_619831 (CHEMBL1106708)
IC50
4000±n/a nM
Citation
 Shiozaki, MImai, HMaeda, KMiura, TYasue, KSuma, AYokota, MOgoshi, YHaas, JFryer, AMLaird, ERLittmann, NMAndrews, SWJosey, JAMimura, TShinozaki, YYoshiuchi, HInaba, T Synthesis and SAR of 2-phenyl-1-sulfonylaminocyclopropane carboxylates as ADAMTS-5 (Aggrecanase-2) inhibitors. Bioorg Med Chem Lett 19:6213-7 (2009)  
Target
Name:
Disintegrin and metalloproteinase domain-containing protein 17
Synonyms:
ADA17_HUMAN CSVP Disintegrin and metalloproteinase domain-containing protein 17 (ADAM17) TNF-alpha convertase TNF-alpha-converting enzyme (TACE) Tumor necrosis factor-α converting enzyme (TACE)
Type:
Enzyme
Mol. Mass.:
93007.89
Organism:
Homo sapiens (Human)
Description:
Residue:
824
  
Inhibitor
Name:
BDBM50311088
Synonyms:
CHEMBL1078281 | cis-rac-1-(5-(4-chloro-1H-pyrazol-1-yl)thiophene-2-sulfonamido)-2-methyl-3-phenylcyclopropanecarboxylic acid
Type:
Small organic molecule
Emp. Form.:
C18H16ClN3O4S2
Mol. Mass.:
437.92
SMILES:
C[C@@H]1[C@H](c2ccccc2)[C@]1(NS(=O)(=O)c1ccc(s1)-n1cc(Cl)cn1)C(O)=O
: